{"text_format":"1","workbook":"xlsx","n_sheets":4,"sheets":["Dati","Scelte","Calcolo costi ammissibili","Calcolo ESL_1"],"not_rendered":{"charts":0,"images":1,"macros":1,"external_links":0,"defined_names":1,"comments":0,"pivot_tables":0},"unopened":[],"bounds":{"document_bytes":16777216,"sheet_cells":100000,"rows_first":2000,"rows_last":500,"rows_between":2000,"halvings":0,"cell_chars":16384,"cell_head_chars":4096},"cells_cut":0,"cells_raw":0,"read":"whole","date_system":"1900"}

{"sheet":"Dati","index":0,"n_rows":37,"n_cols":12,"rows_kept":37,"cut":false,"hidden":false,"merged":[[9,2,9,3],[31,4,31,5],[33,4,33,5],[15,10,15,11],[36,4,36,5],[11,2,11,9],[13,4,13,9],[15,8,15,9],[23,3,25,3],[15,2,15,3]]}
["PR FESR 21-27 Efficienza energetica ed energie rinnovabili nelle imprese - Azione II.2.i.2 \"Efficientamento energetico nelle imprese\" - Bando 2024"]
["Nota. il foglio si riferisce ad un singolo intervento: nel caso di interventi articolati, utilizzare più files e sommare i risultati"]
["Nota. Il foglio si riferisce ad una sola sede: nel caso di più sedi utilizzare più files e fare la somma dei risultati"]
["Importante: compilare i campi in rigida sequenza, in quanto collegati a cascata. Se si modifica un campo, aggiornare i campi successivi resettare."]
[]
[null,"Indicare Dimensione impresa"]
[]
[null,"Indicare se in area 107.3.c",null,"consulta le aree 107.3.c."]
[]
[null,"Inserisci titolo intervento"]
[]
[null,"Scegliere tipologia / art. Reg. 651/14"]
[]
[null,"Indicare il costo dell'intervento",null,"Specifica il tipo di intervento edilizio"]
[]
[null,"I costi supplementari sono rappresentati da:",null,null,null,null,null,{"$f":"IF(C16=Scelte!H16,Scelte!I16,IF(Dati!C16=Scelte!H17,Scelte!I17,IF(Dati!C16=Scelte!H18,Scelte!I18,IF(Dati!C16=Scelte!H19,Scelte!I19,\"\"))))","v":""},null,null,{"$f":"'Calcolo costi ammissibili'!D21","v":0}]
[]
[null,"Costo ammissibile ai sensi di Reg.(UE)651/2014",{"$f":"'Calcolo costi ammissibili'!C28","v":0},{"$f":"IF($H$16=Scelte!I18,\"Imputare:\",\" \")","v":" "},{"$f":"IF(D18=\"Imputare:\",\"Anno1\",\" \")","v":" "},{"$f":"IF(D18=\"Imputare:\",\"Anno2\",\" \")","v":" "},{"$f":"IF(D18=\"Imputare:\",\"Anno3\",\" \")","v":" "},{"$f":"IF(D18=\"Imputare:\",\"Anno4\",\" \")","v":" "},{"$f":"IF(D18=\"Imputare:\",\"Anno5\",\" \")","v":" "},{"$f":"IF(D18=\"Imputare:\",\"Anno6\",\" \")","v":" "},{"$f":"IF(D18=\"Imputare:\",\"Anno7\",\" \")","v":" "},{"$f":"IF(D18=\"Imputare:\",\"Anno8\",\" \")","v":" "}]
[null,null,null,{"$f":"IF($H$16=Scelte!$I$18,Scelte!J$18,\" \")","v":" "}]
[null,"Intensità di aiuto concedibile %",{"$f":"'Calcolo costi ammissibili'!C29","v":0}]
[null,null,null,{"$f":"IF($H$16=Scelte!$I$18,Scelte!K$18,\" \")","v":" "}]
[null,"Aiuto massimo ottenibile (Interessi + contributo)",{"$f":"'Calcolo costi ammissibili'!C31","v":0}]
[null,null,null,{"$f":"IF($H$16=Scelte!$I$18,Scelte!L$18,\" \")","v":" "}]
[null,"Scegliere durata del finanziamento",null,"Durata e preammortamento da scegliere in base all'importo complessivo di TUTTI gli investimenti, inclusi quelli non inseriti in questo foglio"]
[]
[null,"Scegliere preammortamento"]
[]
[null,"Inserire Tasso di riferimento UE",null,"Consulta Tasso riferimento UE in vigore"]
[]
[null,"Indicare spread banca"]
[null,null,null,null,{"$f":"IF('Calcolo costi ammissibili'!C33=\"non concedibile\",\"ESL finanziamento maggiore ESL concedibile\",\"\")","v":""}]
[null,"Finanziamento",{"$f":"IF('Calcolo costi ammissibili'!C33=\"non concedibile\",\"non concedibile\",Scelte!H13)","v":"\""},"Risparmio interessi",{"$f":"'Calcolo costi ammissibili'!C33","v":0},null,"+","pari al",{"$f":"'Calcolo costi ammissibili'!D33","v":0}]
[null,null,"di cui:   70% Finpiemonte - 30% Banca"]
[null,null,null,"Fondo perduto concedibile",{"$f":"'Calcolo costi ammissibili'!C35","v":"non definito"},null,"=","pari al ",{"$f":"'Calcolo costi ammissibili'!D35","v":0}]
[]
[]
[null,null,null,"Beneficio complessivo ottenibile",{"$f":"E32+E34","v":{"$error":"#VALUE!"}}]

{"sheet":"Scelte","index":1,"n_rows":43,"n_cols":12,"rows_kept":43,"cut":false,"hidden":true,"merged":[[8,0,9,0],[8,1,8,4]]}
["menu elenco dimensione"]
["Micro o Piccola impresa",null,null,null,null,null,"scelta impresa",{"$f":"Dati!C6","v":0}]
["Media Impresa"]
["Grande Impresa",null,null,null,null,null,"scelta 107",{"$f":"Dati!C8","v":0}]
["menu elenco area 107"]
["SI",null,null,null,null,null,"Scelta intervento",{"$f":"MID(Dati!C12,1,2)","v":""}]
["NO"]
[null,null,null,null,null,null,"Costo intervento",{"$f":"Dati!C14","v":0}]
["Menu elenco tipologia intervento","Intensita massime %"]
[null,"Art.","MP","ME","GR",null,"Risultato Mix agevolazione","base Finanziamento","base c","finale F","finale C"]
["a) Art. 41 Reg. 651/14 - Impianti di cogenerazione ad alto rendimento Dir. 2012/27/EU, qualificati CAR dal GSE","Art. 41",50,40,30,null,null,{"$f":"IF(H2=A26,65%,IF(H2=A28,75%,IF(H2=A30,85%,\"non definito\")))","v":"non definito"},{"$f":"IF(H11=\"non definito\",\"non definito\",(100%-H11))","v":"non definito"},{"$f":"IF(H6=\"a)\",H11,IF(H6=\"d1\",H11,IF(H4=\"SI\",(H11-5%),H11)))","v":"non definito"},{"$f":"IF(J11=\"non definito\",\"non definito\",(100%-J11))","v":"non definito"}]
["b) Art. 38 Reg. 651/14 - Razionalizzazione dei cicli produttivi e utilizzo efficiente dell’energia","Art. 38",50,40,30,"*","Risultato scelta edilizia",{"$f":"Dati!E14","v":0}]
["c) Art. 38bis Reg. 651/14 - Efficientamento energetico  edifici  per la parte eccedente i  “requisiti minimi” D.M. 26/06/2015, con miglioramento in termini di energia primaria (prestazione energetica edificio); ","Art. 38-bis",50,40,30,"**","importo finanziato",{"$f":"IF(H8>0,(H8*J11),\"\"\"\")","v":"\""},"non concedibile"]
["d1) Art. 41 Reg. 651/14 - Sistemi di building automation connessi a un intervento a) cogenerazione","Art. 38",50,40,30,"*"]
["d2) Art. 38 Reg. 651/14 - Sistemi di building automation connessi a un intervento b) o e) cicli produttivi/linee di produzione","Art. 38",50,40,30,null,"menu elenco sovracosto","origine","testo correlato compare/sparisce","sotttesto1","sottotesto2","sottotesto3"]
["d3) Art. 38bis Reg. 651/14 - Sistemi di building automation connessi a un intervento c) edificio","Art. 38",50,40,30,null,{"$f":"H16","v":"Tutto il costo poiché volto esclusivamente all'efficienza e non esiste investimento analogo meno efficiente"},"Tutto il costo poiché volto esclusivamente all'efficienza e non esiste investimento analogo meno efficiente","  "]
["e) Art. 38 Reg. 651/14 - Sviluppo di processi volti al risparmio energetico, compresa ingegnerizzazione nuove linee di produzione efficienti ","Art. 38",50,40,30,"*",{"$f":"IF($H$6=\"b)\",H17,IF($H$6=\"d2\",H17,IF($H$6=\"e)\",H17,\"\")))","v":""},"Confronto con un investimento meno efficiente dal punto di vista energetico","Valore preventivo di confronto"]
[null,null,null,null,null,null,{"$f":"IF($H$6=\"b)\",H18,IF($H$6=\"d2\",H18,IF($H$6=\"e)\",H18,\"\")))","v":""},"Confronto con il mantenimento degli impianti attuali per la loro vita utile residua","Valore attuale netto dei costi di mantenimento","costi di manutenzione","costi di riparazione","costi di ammodernamento"]
["Menu tipo di intervento edilizio","decurtazioni",null,null,null,null,{"$f":"IF($H$6=\"b)\",H19,IF($H$6=\"d2\",H19,IF($H$6=\"e)\",H19,\"\")))","v":""},"Esisterebbe un termine di confronto, ma non intendo produrne dimostrazione (decurazione aiuto 50%)","  "]
[{"$f":"IF(H6=\"c)\",\"- installazione o sostituzione di un solo tipo di elemento edilizio (comma 12)\",IF(H6=\"d3\",\"- installazione o nella sostituzione di un solo tipo di elemento edilizio (comma 12)\",\"\"))","v":""},0.05]
[{"$f":"IF(H6=\"c)\",\"- per conformarsi a norme UE in vigore entro 18 mesi dalla concessione - un solo elemento edilizio\",IF(H6=\"d3\",\"- per conformarsi a norme UE in vigore entro 18 mesi dalla concessione - un solo elemento edilizio\",\"\"))","v":""},0.15,null,null,null,null,"Menu scelta finanziamento","menu preammortamento","Risultati scelte finanziamento x foglio ESL"]
[{"$f":"IF(H6=\"c)\", \"- per conformarsi a norme UE in vigore entro 18 mesi dalla concessione - altri casi\",IF(H6=\"d3\", \"- per conformarsi a norme UE in vigore entro 18 mesi dalla concessione - altri casi\",\"\"))","v":""},0.1,null,null,null,null,"60 mesi","nessuno","Rate complessive",{"$f":"IF(G27=\"60 mesi\",20,IF(G27=\"72 mesi\",24,IF(G27=\"84 mesi\",28,0)))","v":0}]
[{"$f":"IF(H6=\"c)\", \"- nessuno dei casi precedenti\",IF(H6=\"d3\", \"- nessuno dei casi precedenti\",\"\"))","v":""},0,null,null,null,null,"72 mesi",{"$f":"IF(G27=G22,\"6 mesi\",IF(G27=G23,\"12 mesi\",IF(G27=G24,\"12 mesi\",\"\")))","v":""},"Preammortamento",{"$f":"IF(H27=\"6 mesi\",2,IF(H27=\"12 mesi\",4,0))","v":0}]
[null,null,null,null,null,null,"84 mesi"]
["chi","dove","F","C",null,null,"Scelta importo preventivo di confronto",{"$f":"Dati!I16","v":0}]
[{"$f":"A2","v":"Micro o Piccola impresa"},"fuori",0.65,0.35,null,null,"scelta finanziamento","Scelta preammortamento"]
[{"$f":"A2","v":"Micro o Piccola impresa"},107,0.6,0.4,null,null,{"$f":"Dati!C24","v":0},{"$f":"Dati!C26","v":0}]
[{"$f":"A3","v":"Media Impresa"},"fuori",0.75,0.25]
[{"$f":"A3","v":"Media Impresa"},107,0.7,0.3,null,null,"Scelta metodo sovracosto",{"$f":"Dati!C16","v":0}]
[{"$f":"A4","v":"Grande Impresa"},"fuori",0.85,0.15]
[{"$f":"A4","v":"Grande Impresa"},107,0.8,0.2,null,null,"Tasso di riferimento",{"$f":"Dati!C28","v":0}]
[null,null,null,null,null,null,"Spread banca",{"$f":"Dati!C30","v":0}]
[]
[null,null,null,null,null,null,"Individuazione intensità massima"]
[null,null,null,null,null,null,"% base","eventuale dimezzamento sovracosti","tipo di edilizia","%finale"]
[null,null,null,null,null,null,{"$f":"IF(H2=A2,50%,IF(H2=A3,40%,IF(H2=A4,30%,0)))","v":0},{"$f":"IF(H29=H19,(G36/2))","v":false},{"$f":"IF(H12=0,0,IF(H12=A20,B20,IF(H12=A21,B21,IF(H12=A22,B22,IF(H12=A23,B23,0)))))","v":0},{"$f":"G36-H36-I36","v":0}]
[]
[null,null,null,null,null,null,"Stringa tasso bancario",{"$f":"CONCATENATE(I38,J38)","v":"Tasso di interesse quota banca ,%"},"Tasso di interesse quota banca ",{"$f":"TEXT(K38,\"##,##%\")","v":",%"},{"$f":"H31+H32","v":0}]
[]
[]
["durata fammortamento tutte le scelte metti nota"]
["spread bancario"]
["importo investimento ammissibile deve rimanere invariato con decurtazione"]

{"sheet":"Calcolo costi ammissibili","index":2,"n_rows":35,"n_cols":4,"rows_kept":35,"cut":false,"hidden":true,"merged":[]}
[null,"costo investimento",{"$f":"Dati!C14","v":0}]
[]
["Caso1",{"$f":"Scelte!H16","v":"Tutto il costo poiché volto esclusivamente all'efficienza e non esiste investimento analogo meno efficiente"}]
[null,"costi ammissibili",{"$f":"C1","v":0}]
[]
["Caso2",{"$f":"Scelte!H17","v":"Confronto con un investimento meno efficiente dal punto di vista energetico"}]
[null,"Importo del preventivo di confronto",{"$f":"Scelte!H25","v":0}]
[null,"costi ammissibili",{"$f":"C1-C7","v":0}]
[]
["Caso 3",{"$f":"Scelte!H18","v":"Confronto con il mantenimento degli impianti attuali per la loro vita utile residua"}]
[null,"tasso di attuazlizzazione",{"$f":"Scelte!H31","v":0}]
[null,"tempo (Anno)","Flusso (costi)","PV (o VAN)"]
[null,1,{"$f":"Dati!E19+Dati!E21+Dati!E23","v":0},{"$f":"C13/(1+$C$11)^B13","v":0}]
[null,2,{"$f":"Dati!F19+Dati!F21+Dati!F23","v":0},{"$f":"C14/(1+$C$11)^B14","v":0}]
[null,3,{"$f":"Dati!G19+Dati!G21+Dati!G23","v":0},0]
[null,4,{"$f":"Dati!H19+Dati!H21+Dati!H23","v":0},0]
[null,5,{"$f":"Dati!I19+Dati!I21+Dati!I23","v":0},0]
[null,6,{"$f":"Dati!J19+Dati!J21+Dati!J23","v":0},0]
[null,7,{"$f":"Dati!K19+Dati!K21+Dati!K23","v":0},0]
[null,8,{"$f":"Dati!L19+Dati!L21+Dati!L23","v":0},0]
[null,null,"totale costi di mantenimento attualizzati",{"$f":"SUM(D13:D20)","v":0}]
[null,"costi ammissibili",{"$f":"C1-D21","v":0}]
[]
["Caso 4",{"$f":"Scelte!H19","v":"Esisterebbe un termine di confronto, ma non intendo produrne dimostrazione (decurazione aiuto 50%)"}]
[null,"costi ammissibili",{"$f":"C1","v":0}]
[]
[]
[null,"Costo amissibile risultante dalla scelta",{"$f":"IF(Scelte!H29='Calcolo costi ammissibili'!B3,'Calcolo costi ammissibili'!C4,IF(Scelte!H29='Calcolo costi ammissibili'!B6,'Calcolo costi ammissibili'!C8,IF(Scelte!H29='Calcolo costi ammissibili'!B10,'Calcolo costi ammissibili'!C22,IF(Scelte!H29='Calcolo costi ammissibili'!B24,'Calcolo costi ammissibili'!C25,0))))","v":0}]
[null,"Percentuale massima di Esl ai sensi del reg.651/14",{"$f":"Scelte!J36","v":0}]
[]
[null,"ESL MASSIMO",{"$f":"C28*C29","v":0}]
[]
[null,"ESL FINANZIAMENTO",{"$f":"IF(('Calcolo ESL_1'!K13)>C31,\"non concedibile\",'Calcolo ESL_1'!K13)","v":0},{"$f":"'Calcolo ESL_1'!K14","v":0}]
[]
[null,"CONTRIBUTO",{"$f":"IF(Scelte!K11=\"non definito\",\"non definito\",IF((C1*Scelte!K11)<(C31-C33),(C1*Scelte!K11),(C31-C33)))","v":"non definito"},{"$f":"IF(C35=\"non definito\",0%,(C35/C1))","v":0}]

{"sheet":"Calcolo ESL_1","index":3,"n_rows":213,"n_cols":11,"rows_kept":213,"cut":false,"hidden":false,"merged":[[8,8,8,9],[10,4,10,10],[2,8,2,9],[3,8,3,9],[4,8,4,9],[5,8,5,9],[6,8,6,9],[7,4,7,5],[8,4,8,5],[2,6,2,7],[3,6,3,7],[2,4,2,5],[3,4,3,5],[8,6,8,7],[1,4,1,10],[5,4,5,5],[7,8,7,9],[4,4,4,5],[6,6,6,7],[7,6,7,7],[6,4,6,5],[4,6,4,7],[5,6,5,7]]}
[]
[null,null,null,null,"TABELLA RIEPILOGATIVA DEI PRINCIPALI PIANI DI AMMORTAMENTO APPLICATI"]
[null,null,null,null,"Durata piano di amm.to",null,"Rate effettive",null,"Preammortamento",null,"Rate complessive \n(rate effettive + rate di preammortamento)"]
[null,null,null,null,"A) 60 mesi senza preamm.to",null,20,null,0,null,{"$f":"G4+I4","v":20}]
[null,null,null,null,"A) 60 mesi con preamm.to di 6 mesi",null,18,null,2,null,20]
[null,null,null,null,"B) 72  mesi senza preamm.to",null,24,null,0,null,24]
[null,null,null,null,"B) 72 mesi con preamm.to di 12 mesi",null,20,null,4,null,24]
[null,null,null,null,"C) 84 mesi senza preamm.to",null,28,null,0,null,28]
[null,null,null,null,"C) 84 mesi con preamm.to di 12 mesi",null,24,null,4,null,28]
[]
[null,null,null,null,"TABELLA DI CALCOLO DELL'ESL DEL FINANZIAMENTO "]
["Rate","Capitale Residuo","Esl Rata",1,"Tot. deliberato dalla Banca",{"$f":"Scelte!H13","v":"\""},"Tasso di riferimento**",{"$f":"Scelte!H31","v":0},null,"Tot. progetto Ammesso ",{"$f":"Scelte!H8","v":0}]
[0,{"$f":"F12","v":"\""},null,null,"Preammortamento",{"$f":"Scelte!J23","v":0},"Spread bancario",{"$f":"Scelte!H32","v":0},null,"Esl Totale",{"$f":"SUM(C14:C213)","v":0}]
[{"$f":"IF(A13=\"\",\"\",IF($D$12+A13<=$F$14,$D$12+A13,\"\"))","v":""},{"$f":"IF(A14=\"\",\"\",IF(A14<=$F$13,B13,B13-($F$12/($F$14-$F$13))))","v":""},{"$f":"IF(B14=\"\",\"\",(($H$12+$H$13-$H$14)/(12/$F$15)*(POWER((1/((1+(($H$12+1%)/(12/$F$15))*1))),A14)))*B13)","v":""},null,"Rate complessive",{"$f":"Scelte!J22","v":0},"Tasso Ag.",{"$f":"(1-H15)*(H12+H13)","v":0},null,"Esl %",{"$f":"IF($K$12=0,0,$K$13/$K$12)","v":0}]
["","","",null,"Frequenza",3,"Quota Reg.",0.7]
["","",""]
["","","",null,"** Tasso di riferimento UE per l'Italia"]
["","",""]
["","",""]
["","","",null,null,"campi da compilare"]
["","",""]
["","",""]
["","",""]
["","",""]
["","",""]
["","",""]
["","",""]
["","",""]
["","",""]
["","",""]
["","",""]
["","",""]
["","",""]
["","",""]
["","",""]
["","",""]
["","",""]
["","",""]
["","",""]
["","",""]
["","",""]
["","",""]
["","",""]
["","",""]
["","",""]
[{"$f":"IF(A45=\"\",\"\",IF($D$12+A45<=$F$14,$D$12+A45,\"\"))","v":""},{"$f":"IF(A46=\"\",\"\",IF(A46<=$F$13,B45,B45-($F$12/($F$14-$F$13))))","v":""},{"$f":"IF(B46=\"\",\"\",(($H$12+$H$13-$H$14)/(12/$F$15)*(POWER((1/((1+(($H$12+1%)/(12/$F$15))*1))),A46)))*B45)","v":""}]
["","",""]
["","",""]
["","",""]
["","",""]
["","",""]
["","",""]
["","",""]
["","",""]
["","",""]
["","",""]
["","",""]
["","",""]
["","",""]
["","",""]
["","",""]
["","",""]
["","",""]
["","",""]
["","",""]
["","",""]
["","",""]
["","",""]
["","",""]
["","",""]
["","",""]
["","",""]
["","",""]
["","",""]
["","",""]
["","",""]
["","",""]
[{"$f":"IF(A77=\"\",\"\",IF($D$12+A77<=$F$14,$D$12+A77,\"\"))","v":""},{"$f":"IF(A78=\"\",\"\",IF(A78<=$F$13,B77,B77-($F$12/($F$14-$F$13))))","v":""},{"$f":"IF(B78=\"\",\"\",(($H$12+$H$13-$H$14)/(12/$F$15)*(POWER((1/((1+(($H$12+1%)/(12/$F$15))*1))),A78)))*B77)","v":""}]
["","",""]
["","",""]
["","",""]
["","",""]
["","",""]
["","",""]
["","",""]
["","",""]
["","",""]
["","",""]
["","",""]
["","",""]
["","",""]
["","",""]
["","",""]
["","",""]
["","",""]
["","",""]
["","",""]
["","",""]
["","",""]
["","",""]
["","",""]
["","",""]
["","",""]
["","",""]
["","",""]
["","",""]
["","",""]
["","",""]
["","",""]
[{"$f":"IF(A109=\"\",\"\",IF($D$12+A109<=$F$14,$D$12+A109,\"\"))","v":""},{"$f":"IF(A110=\"\",\"\",IF(A110<=$F$13,B109,B109-($F$12/($F$14-$F$13))))","v":""},{"$f":"IF(B110=\"\",\"\",(($H$12+$H$13-$H$14)/(12/$F$15)*(POWER((1/((1+(($H$12+1%)/(12/$F$15))*1))),A110)))*B109)","v":""}]
["","",""]
["","",""]
["","",""]
["","",""]
["","",""]
["","",""]
["","",""]
["","",""]
["","",""]
["","",""]
["","",""]
["","",""]
["","",""]
["","",""]
["","",""]
["","",""]
["","",""]
["","",""]
["","",""]
["","",""]
["","",""]
["","",""]
["","",""]
["","",""]
["","",""]
["","",""]
["","",""]
["","",""]
["","",""]
["","",""]
["","",""]
[{"$f":"IF(A141=\"\",\"\",IF($D$12+A141<=$F$14,$D$12+A141,\"\"))","v":""},{"$f":"IF(A142=\"\",\"\",IF(A142<=$F$13,B141,B141-($F$12/($F$14-$F$13))))","v":""},{"$f":"IF(B142=\"\",\"\",(($H$12+$H$13-$H$14)/(12/$F$15)*(POWER((1/((1+(($H$12+1%)/(12/$F$15))*1))),A142)))*B141)","v":""}]
["","",""]
["","",""]
["","",""]
["","",""]
["","",""]
["","",""]
["","",""]
["","",""]
["","",""]
["","",""]
["","",""]
["","",""]
["","",""]
["","",""]
["","",""]
["","",""]
["","",""]
["","",""]
["","",""]
["","",""]
["","",""]
["","",""]
["","",""]
["","",""]
["","",""]
["","",""]
["","",""]
["","",""]
["","",""]
["","",""]
["","",""]
[{"$f":"IF(A173=\"\",\"\",IF($D$12+A173<=$F$14,$D$12+A173,\"\"))","v":""},{"$f":"IF(A174=\"\",\"\",IF(A174<=$F$13,B173,B173-($F$12/($F$14-$F$13))))","v":""},{"$f":"IF(B174=\"\",\"\",(($H$12+$H$13-$H$14)/(12/$F$15)*(POWER((1/((1+(($H$12+1%)/(12/$F$15))*1))),A174)))*B173)","v":""}]
["","",""]
["","",""]
["","",""]
["","",""]
["","",""]
["","",""]
["","",""]
["","",""]
["","",""]
["","",""]
["","",""]
["","",""]
["","",""]
["","",""]
["","",""]
["","",""]
["","",""]
["","",""]
["","",""]
["","",""]
["","",""]
["","",""]
["","",""]
["","",""]
["","",""]
["","",""]
["","",""]
["","",""]
["","",""]
["","",""]
["","",""]
[{"$f":"IF(A205=\"\",\"\",IF($D$12+A205<=$F$14,$D$12+A205,\"\"))","v":""},{"$f":"IF(A206=\"\",\"\",IF(A206<=$F$13,B205,B205-($F$12/($F$14-$F$13))))","v":""},{"$f":"IF(B206=\"\",\"\",(($H$12+$H$13-$H$14)/(12/$F$15)*(POWER((1/((1+(($H$12+1%)/(12/$F$15))*1))),A206)))*B205)","v":""}]
["","",""]
["","",""]
["","",""]
["","",""]
["","",""]
["","",""]
["","",""]